{"text_format":"3","workbook":"xlsx","n_sheets":9,"sheets":["Info","Netzbetreiber","SLP-Verfahren","SLP-Temp-Gebiet #01","SLP-Temp-Gebiet #02","SLP-Profile","SLP-Feiertage","BDEW-Standard","Wochentag F(WT)"],"not_rendered":{"images":5,"defined_names":6},"read":"whole","date_system":"1900"}

{"sheet":"Info","index":0,"n_rows":30,"n_cols":3,"rows_kept":30}
[]
[null,"BDEW / VKU / GEODE - Excel-Tabelle mit verfahrensspezifischen Parameter"]
[]
[null,"Im Rahmen der Veröffentlichungspflichten des Netzbetreibers zum Standardlastprofilverfahren hat jeder Netzbetreiber"]
[null,"zu seinem Profilverfahren die folgende Excel-Tabelle auf seiner Internetseite zu veröffentlichen. "]
[]
[null,"Die Veröffentlichung erfolgt im Rahmen der Vorgaben der Kooperationsvereinbarung und des Leitfandens \"Abwicklung von Standardlastprofilen Gas\"."]
[null,"Sofern Anpassungen am Bilanzierungsverfahren vorgenommen werden, ist die Excel-Tabelle stets in aktualisierter Form zu veröffentlichen."]
[]
[null,"Hinweise:"]
[null,"Sofern sich verfahrensspezifische Parameter für vorhandene Netzgebiete unterscheiden, ist für jedes Netzgebiet eine separate Datei auszufüllen."]
[null,"Bei Netzbetreibern mit Marktgebietüberlappung sollte das SLP Verfahren in beiden Marktgebieten identisch sein."]
[null,"Bei Netzbetreibern mit Netzgebieten mit H-Gas und L-Gas ist für jedes Netzgebiet eine separate Datei auszufüllen."]
[]
[null,"Herausgeber:"]
{"$rows_left_out":16}
{"sheet":"Netzbetreiber","index":1,"n_rows":48,"n_cols":4,"rows_kept":48}
[]
[null,"Netzbetreiberinformationen"]
[]
[null,null,"Stand der verf.-spezif.  Parameter (\"Speicherdatum\" der Datei):","2015-09-23"]
[]
[null,null,"verf.-spezif. Parameter dieser Datei sind gültig ab: ","2015-10-01"]
[]
[]
[null,"1.","Name des Netzbetreibers:","Stadtwerke Walldof GmbH & Co. KG"]
[]
[null,"2.","Marktpartner-ID (DVGW-Nummer des Netzbetreibers)","9870096700000"]
[]
[null,"3.","Straße, Nr.:","Altrottstraße 39"]
[]
[null,"4.","Postleitzahl:",{"v":69190,"d":"D-69190"}]
{"$rows_left_out":34}
{"sheet":"SLP-Verfahren","index":2,"n_rows":62,"n_cols":22,"rows_kept":62}
[]
[null,"Stammdaten Netzgebiet"]
[]
[]
[null,null,"Netzbetreiber: ",{"$f":"Netzbetreiber!$D$9","v":"Stadtwerke Walldof GmbH & Co. KG"}]
[null,null,"Netzgebiet: ",{"$f":"Netzbetreiber!D28","v":"Walldorf"}]
[null,null,"Marktpartner-ID: ",{"$f":"Netzbetreiber!$D$11","v":"9870096700000"}]
[null,null,"gültig ab: ",{"$f":"Netzbetreiber!$D$6","v":"2015-10-01"}]
[]
[]
[null,"11.","Marktgebiet:","NCG",{"$nulls":3},"NCG","Gaspool","MGÜ (NCG/Gaspool)"]
[]
[null,"12.","Gasfamilie:","H-Gas",{"$nulls":3},"H-Gas","L-Gas"]
[]
[null,"13.","Netzkontonummer NCG:","NCHN00700967000"]
{"$rows_left_out":48}
{"sheet":"SLP-Temp-Gebiet #01","index":3,"n_rows":72,"n_cols":48,"rows_kept":72,"merged":[[12,2,12,4],[13,2,13,3],[14,2,14,3],[71,2,71,5]]}
[]
[null,"Bildungsregel Temperaturzeitreihe(n)    -  a.) Allokationstemperatur und b.) Kundenwerttemperatur"]
[]
[null,null,"Netzbetreiber: ",null,{"$f":"Netzbetreiber!D9","v":"Stadtwerke Walldof GmbH & Co. KG"}]
[null,null,"Netzgebiet: ",null,{"$f":"Netzbetreiber!D28","v":"Walldorf"}]
[null,null,"Marktpartner-ID: ",null,{"$f":"Netzbetreiber!D11","v":"9870096700000"}]
[null,null,"gültig ab: ",null,{"$f":"Netzbetreiber!D6","v":"2015-10-01"}]
[{"$nulls":7},"Hinweis:"]
[null,null,"Anzahl der Temperaturgebiete des Netzgebietes: ",null,null,{"$f":"'SLP-Verfahren'!D46","v":1},null,"Bei mehreren Temperaturgebieten je Netzgebiet jeweils ein weiteres \"Excel-Tabellenblatt\" je "]
[null,null,"Nummer des Temperaturgebietes:",null,null,1,null,"Temperaturgebiet einfügen. Bitte SLP-Temp-Gebiet # \"##\" in Namen des Excel-Tabellenblattes aufnehmen."]
[null,null,"Name des Temperaturgebietes:",null,null,{"$f":"INDEX('SLP-Verfahren'!D48:D62,'SLP-Temp-Gebiet #01'!F10)","v":"Walldorf"}]
[]
[null,null,"Temperaturversatz (der Knickpunkt Temperatur)",null,null,"Tag:","Monat:","DTKP "]
[null,null,"Heizperiode Kernzeit Winter ",null,"Beginn:","15.","Oktober",{"v":0,"d":"+0.00 °C"},{"$nulls":6},"anderer Wetter-Dienstleister (falls verwendet):",null,null,"Januar","Februar","März","April","Mai","Juni","Juli","August","September","Oktober","November","Dezember"]
[null,null,"Sommer-/Übergangsperiode ",null,"Beginn:","1.","März",{"v":0,"d":"+0.00 °C"},{"$nulls":6},"Deutscher Wetterdienst",null,null,"1.","2.","3.","4.","5.","6.","7.","8.","9.","10.","11.","12.","13.","14.","15.","16.","17.","18.","19.","20.","21.","22.","23.","24.","25.","26.","27.","28.","29.","30.","31."]
{"$rows_left_out":58}
{"sheet":"SLP-Temp-Gebiet #02","index":4,"n_rows":72,"n_cols":48,"rows_kept":72,"hidden":true,"merged":[[12,2,12,4],[13,2,13,3],[14,2,14,3],[71,2,71,5]]}
[]
[null,"Bildungsregel Temperaturzeitreihe(n)    -  a.) Allokationstemperatur und b.) Kundenwerttemperatur"]
[]
[null,null,"Netzbetreiber: ",null,{"$f":"Netzbetreiber!$D$9","v":"Stadtwerke Walldof GmbH & Co. KG"}]
[null,null,"Netzgebiet: ",null,{"$f":"Netzbetreiber!$D$28","v":"Walldorf"}]
[null,null,"Marktpartner-ID: ",null,{"$f":"Netzbetreiber!$D$11","v":"9870096700000"}]
[null,null,"gültig ab: ",null,{"$f":"Netzbetreiber!$D$6","v":"2015-10-01"}]
[{"$nulls":7},"Hinweis:"]
[null,null,"Anzahl der Temperaturgebiete des Netzgebietes: ",null,null,{"$f":"'SLP-Verfahren'!D46","v":1},null,"Bei mehreren Temperaturgebieten je Netzgebiet jeweils ein weiteres \"Excel-Tabellenblatt\" je "]
[null,null,"Nummer des Temperaturgebietes:",null,null,2,null,"Temperaturgebiet einfügen. Bitte SLP-Temp-Gebiet # \"##\" in Namen des Excel-Tabellenblattes aufnehmen."]
[null,null,"Name des Temperaturgebietes:",null,null,{"$f":"INDEX('SLP-Verfahren'!D48:D62,'SLP-Temp-Gebiet #02'!F10)","v":0}]
[]
[null,null,"Temperaturversatz (der Knickpunkt Temperatur)",null,null,"Tag:","Monat:","DTKP "]
[null,null,"Heizperiode Kernzeit Winter ",null,"Beginn:","15.","Oktober",{"v":0,"d":"+0.00 °C"},{"$nulls":6},"anderer Wetter-Dienstleister (falls verwendet):",null,null,"Januar","Februar","März","April","Mai","Juni","Juli","August","September","Oktober","November","Dezember"]
[null,null,"Sommer-/Übergangsperiode ",null,"Beginn:","1.","März",{"v":0,"d":"+0.00 °C"},{"$nulls":6},"Wetterdienstleister ABC",null,null,"1.","2.","3.","4.","5.","6.","7.","8.","9.","10.","11.","12.","13.","14.","15.","16.","17.","18.","19.","20.","21.","22.","23.","24.","25.","26.","27.","28.","29.","30.","31."]
{"$rows_left_out":58}
{"sheet":"SLP-Profile","index":5,"n_rows":41,"n_cols":25,"rows_kept":41}
[]
[null,"Verwendete SLP Profiltypen"]
[null,"Hier sind alle vom Netzbetreiber im Netzgebiet verwendeten SLP-Profiltypen aufzuführen."]
[]
[null,null,"Netzbetreiber:",{"$f":"Netzbetreiber!$D$9","v":"Stadtwerke Walldof GmbH & Co. KG"},{"$nulls":5},"Hinweis:","Profilnomenklaturen können in Zelle \"E11\" eingesehen werden. Doppelt hinterlegte Profile sind rot markiert"]
[null,null,"Netzgebiet:",{"$f":"Netzbetreiber!$D$28","v":"Walldorf"},{"$nulls":6},"Formeln/Koeffizienten zur Koeffizientenübernahme der BDEW-Profile können aus Zeile \"11\" übernommen werden"]
[null,null,"Marktpartner-ID: ",{"$f":"Netzbetreiber!$D$11","v":"9870096700000"}]
[null,null,"gültig ab: ",{"$f":"Netzbetreiber!$D$6","v":"2015-10-01"},{"$nulls":3},"Anzahl verwendeter Profile:",null,{"$f":"COUNTA(D12:D100)","v":13}]
[{"$nulls":5},2,null,4,5,6,7,8,9,10,11,12,8,3,4,5,6,7,8,9]
[null,"#","Netzgebiet","Profil-Art","BDEW Nomen-\nklatur","EDI-CODE",null,"A","B","C","D","ϑ0","mH","bH","mW","bW","h(8°C) \n(FWT = 1)","FWT (Mo.)","FWT (Di.)","FWT (Mi.)","FWT (Do.)","FWT (Fr.)","FWT (Sa.)","FWT (So.)","Multiplikator MSLP \nUmrechnungsfaktor: \nKW  =  JVP / MSLP"]
[null,"Muster","Abruf von BDEW-Standardwerten:","BDEW","DE_GKO34",{"$f":"VLOOKUP($E11,'BDEW-Standard'!$B$3:$M$158,F$9,0)","v":"OK4"},null,{"$f":"ROUND(VLOOKUP($E11,'BDEW-Standard'!$B$3:$M$158,H$9,0),7)","v":{"v":1.4256684,"d":"1.4256684 "}},{"$f":"ROUND(VLOOKUP($E11,'BDEW-Standard'!$B$3:$M$158,I$9,0),7)","v":-36.6590504},{"$f":"ROUND(VLOOKUP($E11,'BDEW-Standard'!$B$3:$M$158,J$9,0),7)","v":{"v":7.6083226,"d":"7.6083226 "}},{"$f":"ROUND(VLOOKUP($E11,'BDEW-Standard'!$B$3:$M$158,K$9,0),7)","v":{"v":0.0371116,"d":"0.0371116 "}},{"$f":"ROUND(VLOOKUP($E11,'BDEW-Standard'!$B$3:$M$158,L$9,0),1)","v":{"v":40,"d":"40.0 "}},{"$f":"ROUND(VLOOKUP($E11,'BDEW-Standard'!$B$3:$M$158,M$9,0),7)","v":-0.0809359},{"$f":"ROUND(VLOOKUP($E11,'BDEW-Standard'!$B$3:$M$158,N$9,0),7)","v":{"v":1.2364527,"d":"1.2364527 "}},{"$f":"ROUND(VLOOKUP($E11,'BDEW-Standard'!$B$3:$M$158,O$9,0),7)","v":{"v":-7.628E-4,"d":"-0.0007628"}},{"$f":"ROUND(VLOOKUP($E11,'BDEW-Standard'!$B$3:$M$158,P$9,0),7)","v":{"v":0.1002979,"d":"0.1002979 "}},{"$f":"($H11/(1+($I11/($Q$9-$L11))^$J11)+$K11)+MAX($M11*$Q$9+$N11,$O11*$Q$9+$P11)","v":{"v":0.9999999603349892,"d":"1.00000 "}},{"$f":"ROUND(VLOOKUP(MID($E11,4,3),'Wochentag F(WT)'!$B$7:$J$22,R$9,0),4)","v":1.0354},{"$f":"ROUND(VLOOKUP(MID($E11,4,3),'Wochentag F(WT)'!$B$7:$J$22,S$9,0),4)","v":1.0523},{"$f":"ROUND(VLOOKUP(MID($E11,4,3),'Wochentag F(WT)'!$B$7:$J$22,T$9,0),4)","v":1.0449},{"$f":"ROUND(VLOOKUP(MID($E11,4,3),'Wochentag F(WT)'!$B$7:$J$22,U$9,0),4)","v":1.0494},{"$f":"ROUND(VLOOKUP(MID($E11,4,3),'Wochentag F(WT)'!$B$7:$J$22,V$9,0),4)","v":0.9885},{"$f":"ROUND(VLOOKUP(MID($E11,4,3),'Wochentag F(WT)'!$B$7:$J$22,W$9,0),4)","v":{"v":0.886,"d":"0.8860"}},{"$f":"7-SUM(R11:W11)","v":{"v":0.9434999999999993,"d":"0.9435"}},365.123]
[null,1,{"$f":"$D$6","v":"Walldorf"},"BDEW","BW_HEF04",{"$f":"VLOOKUP($E12,'BDEW-Standard'!$B$3:$M$158,F$9,0)","v":"W14"},null,{"$f":"ROUND(VLOOKUP($E12,'BDEW-Standard'!$B$3:$M$158,H$9,0),7)","v":{"v":3.1764404,"d":"3.1764404 "}},{"$f":"ROUND(VLOOKUP($E12,'BDEW-Standard'!$B$3:$M$158,I$9,0),7)","v":-37.4105832},{"$f":"ROUND(VLOOKUP($E12,'BDEW-Standard'!$B$3:$M$158,J$9,0),7)","v":{"v":6.1622336,"d":"6.1622336 "}},{"$f":"ROUND(VLOOKUP($E12,'BDEW-Standard'!$B$3:$M$158,K$9,0),7)","v":{"v":0.0759377,"d":"0.0759377 "}},{"$f":"ROUND(VLOOKUP($E12,'BDEW-Standard'!$B$3:$M$158,L$9,0),1)","v":{"v":40,"d":"40.0"}},{"$f":"ROUND(VLOOKUP($E12,'BDEW-Standard'!$B$3:$M$158,M$9,0),7)","v":0},{"$f":"ROUND(VLOOKUP($E12,'BDEW-Standard'!$B$3:$M$158,N$9,0),7)","v":0},{"$f":"ROUND(VLOOKUP($E12,'BDEW-Standard'!$B$3:$M$158,O$9,0),7)","v":0},{"$f":"ROUND(VLOOKUP($E12,'BDEW-Standard'!$B$3:$M$158,P$9,0),7)","v":0},{"$f":"($H12/(1+($I12/($Q$9-$L12))^$J12)+$K12)+MAX($M12*$Q$9+$N12,$O12*$Q$9+$P12)","v":{"v":0.9537403328806262,"d":"0.95374 "}},{"$f":"ROUND(VLOOKUP(MID($E12,4,3),'Wochentag F(WT)'!$B$7:$J$22,R$9,0),4)","v":{"v":1,"d":"1.0000"}},{"$f":"ROUND(VLOOKUP(MID($E12,4,3),'Wochentag F(WT)'!$B$7:$J$22,S$9,0),4)","v":{"v":1,"d":"1.0000"}},{"$f":"ROUND(VLOOKUP(MID($E12,4,3),'Wochentag F(WT)'!$B$7:$J$22,T$9,0),4)","v":{"v":1,"d":"1.0000"}},{"$f":"ROUND(VLOOKUP(MID($E12,4,3),'Wochentag F(WT)'!$B$7:$J$22,U$9,0),4)","v":{"v":1,"d":"1.0000"}},{"$f":"ROUND(VLOOKUP(MID($E12,4,3),'Wochentag F(WT)'!$B$7:$J$22,V$9,0),4)","v":{"v":1,"d":"1.0000"}},{"$f":"ROUND(VLOOKUP(MID($E12,4,3),'Wochentag F(WT)'!$B$7:$J$22,W$9,0),4)","v":{"v":1,"d":"1.0000"}},{"$f":"7-SUM(R12:W12)","v":{"v":1,"d":"1.0000"}}]
[null,2,"Walldorf","BDEW","BW_HMF04",{"$f":"VLOOKUP($E13,'BDEW-Standard'!$B$3:$M$158,F$9,0)","v":"W24"},null,{"$f":"ROUND(VLOOKUP($E13,'BDEW-Standard'!$B$3:$M$158,H$9,0),7)","v":{"v":2.507817,"d":"2.5078170 "}},{"$f":"ROUND(VLOOKUP($E13,'BDEW-Standard'!$B$3:$M$158,I$9,0),7)","v":-35.0367363},{"$f":"ROUND(VLOOKUP($E13,'BDEW-Standard'!$B$3:$M$158,J$9,0),7)","v":{"v":6.2430159,"d":"6.2430159 "}},{"$f":"ROUND(VLOOKUP($E13,'BDEW-Standard'!$B$3:$M$158,K$9,0),7)","v":{"v":0.1025195,"d":"0.1025195 "}},{"$f":"ROUND(VLOOKUP($E13,'BDEW-Standard'!$B$3:$M$158,L$9,0),1)","v":{"v":40,"d":"40.0"}},{"$f":"ROUND(VLOOKUP($E13,'BDEW-Standard'!$B$3:$M$158,M$9,0),7)","v":0},{"$f":"ROUND(VLOOKUP($E13,'BDEW-Standard'!$B$3:$M$158,N$9,0),7)","v":0},{"$f":"ROUND(VLOOKUP($E13,'BDEW-Standard'!$B$3:$M$158,O$9,0),7)","v":0},{"$f":"ROUND(VLOOKUP($E13,'BDEW-Standard'!$B$3:$M$158,P$9,0),7)","v":0},{"v":1.0107516326442527,"d":"1.01075 "},{"$f":"ROUND(VLOOKUP(MID($E13,4,3),'Wochentag F(WT)'!$B$7:$J$22,R$9,0),4)","v":{"v":1,"d":"1.0000"}},{"$f":"ROUND(VLOOKUP(MID($E13,4,3),'Wochentag F(WT)'!$B$7:$J$22,S$9,0),4)","v":{"v":1,"d":"1.0000"}},{"$f":"ROUND(VLOOKUP(MID($E13,4,3),'Wochentag F(WT)'!$B$7:$J$22,T$9,0),4)","v":{"v":1,"d":"1.0000"}},{"$f":"ROUND(VLOOKUP(MID($E13,4,3),'Wochentag F(WT)'!$B$7:$J$22,U$9,0),4)","v":{"v":1,"d":"1.0000"}},{"$f":"ROUND(VLOOKUP(MID($E13,4,3),'Wochentag F(WT)'!$B$7:$J$22,V$9,0),4)","v":{"v":1,"d":"1.0000"}},{"$f":"ROUND(VLOOKUP(MID($E13,4,3),'Wochentag F(WT)'!$B$7:$J$22,W$9,0),4)","v":{"v":1,"d":"1.0000"}},{"$f":"7-SUM(R13:W13)","v":{"v":1,"d":"1.0000"}}]
[null,3,"Walldorf","BDEW","DE_GMK04",{"$f":"VLOOKUP($E14,'BDEW-Standard'!$B$3:$M$158,F$9,0)","v":"MK4"},null,{"$f":"ROUND(VLOOKUP($E14,'BDEW-Standard'!$B$3:$M$158,H$9,0),7)","v":{"v":3.1177248,"d":"3.1177248 "}},{"$f":"ROUND(VLOOKUP($E14,'BDEW-Standard'!$B$3:$M$158,I$9,0),7)","v":-35.8715062},{"$f":"ROUND(VLOOKUP($E14,'BDEW-Standard'!$B$3:$M$158,J$9,0),7)","v":{"v":7.5186829,"d":"7.5186829 "}},{"$f":"ROUND(VLOOKUP($E14,'BDEW-Standard'!$B$3:$M$158,K$9,0),7)","v":{"v":0.0343301,"d":"0.0343301 "}},{"$f":"ROUND(VLOOKUP($E14,'BDEW-Standard'!$B$3:$M$158,L$9,0),1)","v":{"v":40,"d":"40.0"}},{"$f":"ROUND(VLOOKUP($E14,'BDEW-Standard'!$B$3:$M$158,M$9,0),7)","v":0},{"$f":"ROUND(VLOOKUP($E14,'BDEW-Standard'!$B$3:$M$158,N$9,0),7)","v":0},{"$f":"ROUND(VLOOKUP($E14,'BDEW-Standard'!$B$3:$M$158,O$9,0),7)","v":0},{"$f":"ROUND(VLOOKUP($E14,'BDEW-Standard'!$B$3:$M$158,P$9,0),7)","v":0},{"v":0.9622064996731321,"d":"0.96221 "},{"$f":"ROUND(VLOOKUP(MID($E14,4,3),'Wochentag F(WT)'!$B$7:$J$22,R$9,0),4)","v":1.0699},{"$f":"ROUND(VLOOKUP(MID($E14,4,3),'Wochentag F(WT)'!$B$7:$J$22,S$9,0),4)","v":1.0365},{"$f":"ROUND(VLOOKUP(MID($E14,4,3),'Wochentag F(WT)'!$B$7:$J$22,T$9,0),4)","v":0.9933},{"$f":"ROUND(VLOOKUP(MID($E14,4,3),'Wochentag F(WT)'!$B$7:$J$22,U$9,0),4)","v":0.9948},{"$f":"ROUND(VLOOKUP(MID($E14,4,3),'Wochentag F(WT)'!$B$7:$J$22,V$9,0),4)","v":1.0659},{"$f":"ROUND(VLOOKUP(MID($E14,4,3),'Wochentag F(WT)'!$B$7:$J$22,W$9,0),4)","v":0.9362},{"v":0.9033999999999995,"d":"0.9034"}]
[null,4,"Walldorf","BDEW","DE_GHA04",{"$f":"VLOOKUP($E15,'BDEW-Standard'!$B$3:$M$158,F$9,0)","v":"HA4"},null,{"$f":"ROUND(VLOOKUP($E15,'BDEW-Standard'!$B$3:$M$158,H$9,0),7)","v":{"v":4.0196902,"d":"4.0196902 "}},{"$f":"ROUND(VLOOKUP($E15,'BDEW-Standard'!$B$3:$M$158,I$9,0),7)","v":-37.8282037},{"$f":"ROUND(VLOOKUP($E15,'BDEW-Standard'!$B$3:$M$158,J$9,0),7)","v":{"v":8.1593369,"d":"8.1593369 "}},{"$f":"ROUND(VLOOKUP($E15,'BDEW-Standard'!$B$3:$M$158,K$9,0),7)","v":{"v":0.0472845,"d":"0.0472845 "}},{"$f":"ROUND(VLOOKUP($E15,'BDEW-Standard'!$B$3:$M$158,L$9,0),1)","v":{"v":40,"d":"40.0"}},{"$f":"ROUND(VLOOKUP($E15,'BDEW-Standard'!$B$3:$M$158,M$9,0),7)","v":0},{"$f":"ROUND(VLOOKUP($E15,'BDEW-Standard'!$B$3:$M$158,N$9,0),7)","v":0},{"$f":"ROUND(VLOOKUP($E15,'BDEW-Standard'!$B$3:$M$158,O$9,0),7)","v":0},{"$f":"ROUND(VLOOKUP($E15,'BDEW-Standard'!$B$3:$M$158,P$9,0),7)","v":0},{"v":0.8648671330326079,"d":"0.86487 "},{"$f":"ROUND(VLOOKUP(MID($E15,4,3),'Wochentag F(WT)'!$B$7:$J$22,R$9,0),4)","v":1.0358},{"$f":"ROUND(VLOOKUP(MID($E15,4,3),'Wochentag F(WT)'!$B$7:$J$22,S$9,0),4)","v":1.0232},{"$f":"ROUND(VLOOKUP(MID($E15,4,3),'Wochentag F(WT)'!$B$7:$J$22,T$9,0),4)","v":1.0252},{"$f":"ROUND(VLOOKUP(MID($E15,4,3),'Wochentag F(WT)'!$B$7:$J$22,U$9,0),4)","v":1.0295},{"$f":"ROUND(VLOOKUP(MID($E15,4,3),'Wochentag F(WT)'!$B$7:$J$22,V$9,0),4)","v":1.0253},{"$f":"ROUND(VLOOKUP(MID($E15,4,3),'Wochentag F(WT)'!$B$7:$J$22,W$9,0),4)","v":0.9675},{"v":0.8935000000000004,"d":"0.8935"}]
{"$rows_left_out":27}
{"sheet":"SLP-Feiertage","index":6,"n_rows":33,"n_cols":30,"rows_kept":33,"merged":[[7,12,7,29],[9,1,9,2],[9,5,9,11]]}
[]
[null,"Feiertagskalender / Sondertage"]
[]
[null,"Netzbetreiber: ",{"$f":"Netzbetreiber!$D$9","v":"Stadtwerke Walldof GmbH & Co. KG"},{"$nulls":9},"Verwendeter Feiertagskalender bitte markieren (auch Mehrfachnennungen möglich)"]
[null,"Netzgebiet: ",{"$f":"Netzbetreiber!$D$28","v":"Walldorf"},{"$nulls":9},"Hinweis: Entsprechende Feiertage / Ersatztage werden grau-grün markiert"]
[null,"MP-ID: ",{"$f":"Netzbetreiber!$D$11","v":"9870096700000"}]
[null,"gültig ab: ",{"$f":"Netzbetreiber!$D$6","v":"2015-10-01"}]
[{"$nulls":12},"Vorgaben für Feiertagskalender bundesweit / bundeslandspezif / NB-individuell"]
[{"$nulls":12}," DE  "," HB  "," HH  "," SL  "," BE  "," HE  "," NI  "," NW  "," BW  "," RP  "," SH  "," SN  "," BB  "," BY  "," MV  "," ST  "," TH  ","NB"]
[null,"verwendeter Feiertagskalender des Netzgebiets",null,2,{"$f":"IF(ISERROR(HLOOKUP(E$11,$M$9:$AD$33,$D10,0)),\"\",HLOOKUP(E$11,$M$9:$AD$33,$D10,0))","v":""},"Wochentag und entsprechender Ersatztag",{"$nulls":6},"BRD, bundesweit ","Bremen  ","Hamburg  ","Saarland  ","Berlin  ","Hessen  ","Nieder-sachsen  ","Nordrhein-Westfalen  ","Baden-Württemberg  ","Rheinland-Pfalz  ","Schleswig-Holstein  ","Sachsen  ","Brandenburg  ","Bayern  ","Mecklenburg-Vorpommern  ","Sachsen-Anhalt  ","Thüringen  ","NB-individuell"]
[null,"Feiertag / Sondertag ",null,3,null,"Montag","Dienstag","Mittwoch","Donnerstag","Freitag","Samstag","Sonntag",1,0,0,0,0,0,0,0,0,0,0,0,0,0,0,0,0,0]
[null,"Neujahr (1.1.)",null,4,{"$f":"MIN(SUMPRODUCT($M$11:$AD$11,M12:AD12),1)","v":1},"Sonntag","Sonntag","Sonntag","Sonntag","Sonntag","Sonntag","Sonntag",1,1,1,1,1,1,1,1,1,1,1,1,1,1,1,1,1,1]
[null,"Heilige Drei Könige (6.1.)",null,5,{"$f":"MIN(SUMPRODUCT($M$11:$AD$11,M13:AD13),1)","v":0},"Sonntag","Sonntag","Sonntag","Sonntag","Sonntag","Sonntag","Sonntag",{"$nulls":8},1,{"$nulls":4},1,null,1]
[null,"Rosenmontag (-48 Tage)",null,6,0,"Sonntag","-","-","-","-","-","-"]
[null,"Faschingsdienstag (-47 Tage)",null,7,0,"-","Samstag","-","-","-","-","-"]
{"$rows_left_out":19}
{"sheet":"BDEW-Standard","index":7,"n_rows":158,"n_cols":13,"rows_kept":158,"hidden":true}
["Stand: ","2015-06-18",null,"BDEW Standardlastprofile - SLP-Koef. ",null,"hier keine Eintragungen / Veränderungen vornehmen !"]
["Quelle","BDEW Nomenklatur","EDI-CODE","Profilname","A","B","C","D","J0","m_H","b_H","m_W","b_W"]
[{"$f":"IF(MID(D3,1,8)=\"SigLinDe\",\"SLP-FfE\",\"SLP-TUM\")","v":"SLP-TUM"},{"$f":"\"DE_\"&IF(A3=\"SLP-TUM\",MID(D3,5,4)&RIGHT(D3,1),\"\")&IF(A3=\"SLP-FfE\",MID(#REF!,5,3)&\"3\"&RIGHT(#REF!,1),\"\")","v":"DE_HEF03"},{"$f":"IF(A3=\"SLP-TUM\",LEFT(D3,3),\"\")&IF(A3=\"SLP-FfE\",MID(#REF!,2,1)&MID(#REF!,1,1)&MID(#REF!,3,1),\"\")","v":"D13"},"D13/HEF03",3.04696946,{"v":-37.18331413,"d":"-37.18331413 "},{"v":5.672784662,"d":"5.67278466"},0.09619306,{"v":40,"d":"40.0"},0,0,0,0]
[{"$f":"IF(MID(D4,1,8)=\"SigLinDe\",\"SLP-FfE\",\"SLP-TUM\")","v":"SLP-TUM"},{"$f":"\"DE_\"&IF(A4=\"SLP-TUM\",MID(D4,5,4)&RIGHT(D4,1),\"\")&IF(A4=\"SLP-FfE\",MID(D1,5,3)&\"3\"&RIGHT(D1,1),\"\")","v":"DE_HEF04"},{"$f":"IF(A4=\"SLP-TUM\",LEFT(D4,3),\"\")&IF(A4=\"SLP-FfE\",MID(D1,2,1)&MID(D1,1,1)&MID(D1,3,1),\"\")","v":"D14"},"D14/HEF04",3.18501913,{"v":-37.41241549,"d":"-37.41241549 "},{"v":6.172317873,"d":"6.17231787"},{"v":0.076109594,"d":"0.07610959"},{"v":40,"d":"40.0"},0,0,0,0]
["SLP-TUM","DE_HEF05","D15","D15/HEF05",{"v":3.345666672,"d":"3.34566667"},{"v":-37.52683159,"d":"-37.52683159 "},{"v":6.432893683,"d":"6.43289368"},{"v":0.056256618,"d":"0.05625662"},{"v":40,"d":"40.0"},0,0,0,0]
["SLP-FfE",{"$f":"\"DE_\"&IF(A6=\"SLP-TUM\",MID(D6,5,4)&RIGHT(D6,1),\"\")&IF(A6=\"SLP-FfE\",MID(D3,5,3)&\"3\"&RIGHT(D3,1),\"\")","v":"DE_HEF33"},"1D3","SigLinDe FfE/'HEF03'",{"v":1.62095442221218,"d":"1.62095442"},{"v":-37.18331413,"d":"-37.18331413 "},{"v":5.672784662,"d":"5.67278466"},{"v":0.0716431179426293,"d":"0.07164312"},{"v":40,"d":"40.0"},{"v":-0.049570015603148,"d":"- 0.04957002 "},{"v":0.840101458080529,"d":" 0.84010146 "},{"v":-2.20902646706885E-3,"d":"- 0.00220903 "},{"v":0.107446796243988,"d":" 0.10744680 "}]
["SLP-FfE","DE_HEF34","1D4","SigLinDe FfE/'HEF04'",{"v":1.38196630429025,"d":"1.38196630"},{"v":-37.41241549,"d":"-37.41241549 "},{"v":6.172317873,"d":"6.17231787"},{"v":0.039628356395289,"d":"0.03962836"},{"v":40,"d":"40.0"},{"v":-0.0672158729377494,"d":"- 0.06721587 "},{"v":1.11671383851592,"d":" 1.11671384 "},{"v":-0.00199816476877116,"d":"- 0.00199816 "},{"v":0.135506974393588,"d":" 0.13550697 "}]
["SLP-TUM","DE_HMF03","D23","D23/HMF03",{"v":2.387761791,"d":"2.38776179"},{"v":-34.72136051,"d":"-34.72136051 "},{"v":5.816430402,"d":"5.81643040"},{"v":0.120819368,"d":"0.12081937"},{"v":40,"d":"40.0"},0,0,0,0]
["SLP-TUM","DE_HMF04","D24","D24/HMF04",{"v":2.518777519,"d":"2.51877752"},{"v":-35.03337542,"d":"-35.03337542 "},{"v":6.224063396,"d":"6.22406340"},{"v":0.101078172,"d":"0.10107817"},{"v":40,"d":"40.0"},0,0,0,0]
["SLP-TUM","DE_HMF05","D25","D25/HMF05",{"v":2.656440592,"d":"2.65644059"},{"v":-35.25169267,"d":"-35.25169267 "},{"v":6.518265862,"d":"6.51826586"},{"v":0.081205866,"d":"0.08120587"},{"v":40,"d":"40.0"},0,0,0,0]
["SLP-FfE","DE_HMF33","2D3","SigLinDe FfE/'HMF03'",{"v":1.23286546541232,"d":"1.23286547"},{"v":-34.72136051,"d":"-34.72136051 "},{"v":5.816430402,"d":"5.81643040"},{"v":0.0873351930206002,"d":"0.08733519"},{"v":40,"d":"40.0"},{"v":-0.0409283994003907,"d":"- 0.04092840 "},{"v":0.767292039450741,"d":" 0.76729204 "},{"v":-2.23202741619469E-3,"d":"- 0.00223203 "},{"v":0.119920720218609,"d":" 0.11992072 "}]
["SLP-FfE","DE_HMF34","2D4","SigLinDe FfE/'HMF04'",{"v":1.04435376805832,"d":"1.04435377"},{"v":-35.03337542,"d":"-35.03337542 "},{"v":6.224063396,"d":"6.22406340"},{"v":0.0502917160409897,"d":"0.05029172"},{"v":40,"d":"40.0"},{"v":-0.0535830222357689,"d":"- 0.05358302 "},{"v":0.999590090399734,"d":" 0.99959009 "},{"v":-2.17584483209612E-3,"d":"- 0.00217584 "},{"v":0.163329881177145,"d":" 0.16332988 "}]
["SLP-TUM","DE_HKO03","HK3","HK3/HKO03",{"v":0.4040932,"d":"0.40409320"},{"v":-24.4392968,"d":"-24.43929680 "},{"v":6.5718175,"d":"6.57181750"},{"v":0.710771,"d":"0.71077100"},{"v":40,"d":"40.0"},0,0,0,0]
["SLP-TUM","DE_GMK01","MK1","MK1/GMK01",{"v":1.864453364,"d":"1.86445336"},{"v":-30.70716325,"d":"-30.70716325 "},{"v":6.462693731,"d":"6.46269373"},{"v":0.104833866,"d":"0.10483387"},{"v":40,"d":"40.0"},0,0,0,0]
["SLP-TUM","DE_GMK02","MK2","MK2/GMK02",{"v":2.290818386,"d":"2.29081839"},{"v":-33.14768673,"d":"-33.14768673 "},{"v":6.371476504,"d":"6.37147650"},{"v":0.081002321,"d":"0.08100232"},{"v":40,"d":"40.0"},0,0,0,0]
{"$rows_left_out":144}
{"sheet":"Wochentag F(WT)","index":8,"n_rows":22,"n_cols":16,"rows_kept":22,"hidden":true,"merged":[[2,0,3,0],[2,3,2,9]]}
["BDEW Standardlastprofile - WT-Koef. ",null,null,"hier keine Eintragungen / Veränderungen vornehmen !"]
[null,"Wochentagfaktoren gemäß TUM"]
["#","  Bezeichnung",null,"Wochentagfaktoren"]
[{"$nulls":3},"F(Mo)","F(Di)","F(Mi)","F(Do)","F(Fr)","F(Sa)","F(So)"]
[null,"Tag",null,"Mo","Di","Mi","Do","Fr","Sa","So","Mo-So","Max Tag","Max Wert","Profil-Art","H/N-Profil","Alternative Profilempfehlung"]
[null,1,2,3,4,5,6,7,8,9,10,11,12]
[1,"HEF","Einfamilienhaushalt",{"v":1,"d":"1.0000  "},{"v":1,"d":"1.0000  "},{"v":1,"d":"1.0000  "},{"v":1,"d":"1.0000  "},{"v":1,"d":"1.0000  "},{"v":1,"d":"1.0000  "},{"v":1,"d":"1.0000  "},{"v":1,"d":"1.0000  "},"Mo-So",{"$f":"MAX(D7:J7)","v":{"v":1,"d":"1.0000  "}},"Heizgas"]
[2,"HMF","Mehrfamilienhaushalt",{"v":1,"d":"1.0000  "},{"v":1,"d":"1.0000  "},{"v":1,"d":"1.0000  "},{"v":1,"d":"1.0000  "},{"v":1,"d":"1.0000  "},{"v":1,"d":"1.0000  "},{"v":1,"d":"1.0000  "},{"v":1,"d":"1.0000  "},"Mo-So",{"v":1,"d":"1.0000  "},"Heizgas"]
[3,"HKO","Kochgas",{"v":1,"d":"1.0000  "},{"v":1,"d":"1.0000  "},{"v":1,"d":"1.0000  "},{"v":1,"d":"1.0000  "},{"v":1,"d":"1.0000  "},{"v":1,"d":"1.0000  "},{"v":1,"d":"1.0000  "},{"v":1,"d":"1.0000  "},"Mo-So",{"$f":"MAX(D9:J9)","v":{"v":1,"d":"1.0000  "}},"Kochgas"]
[]
[4,"GKO","Gebietskörpersch., Kreditinst. u. Versich., Org. o. Erwerbszw. & öff. Einr.",{"v":1.0353906654726432,"d":"1.0354  "},{"v":1.0522626697461936,"d":"1.0523  "},{"v":1.044930469815579,"d":"1.0449  "},{"v":1.0493599072216477,"d":"1.0494  "},{"v":0.9884597489777012,"d":"0.9885  "},{"v":0.8860056359071147,"d":"0.8860  "},{"v":0.9435909028591213,"d":"0.9436  "},{"v":1,"d":"1.0000  "},"Di",{"v":1.0522626697461936,"d":"1.0523  "},"Gewerbe","Hauptprofil"]
[5,"GHA","Einzelhandel, Großhandel",{"v":1.0358469949391176,"d":"1.0358  "},{"v":1.02316516044779,"d":"1.0232  "},{"v":1.025224616371781,"d":"1.0252  "},{"v":1.0295353991682878,"d":"1.0295  "},{"v":1.0252886184395307,"d":"1.0253  "},{"v":0.9674952706583615,"d":"0.9675  "},{"v":0.8934439399751309,"d":"0.8934  "},{"v":1,"d":"1.0000  "},"Mo",{"v":1.0358469949391176,"d":"1.0358  "},"Gewerbe","Hauptprofil"]
[6,"GMK","Metall, Kfz",{"v":1.069856584592316,"d":"1.0699  "},{"v":1.0365322101473011,"d":"1.0365  "},{"v":0.9932557179192343,"d":"0.9933  "},{"v":0.9947828488586291,"d":"0.9948  "},{"v":1.065870859929255,"d":"1.0659  "},{"v":0.9362449719696236,"d":"0.9362  "},{"v":0.9034568065836398,"d":"0.9035  "},{"v":1,"d":"1.0000  "},"Mo",{"v":1.069856584592316,"d":"1.0699  "},"Gewerbe","Hauptprofil"]
[7,"GBD","sonst. betr. Dienstleistungen",{"v":1.1052461689,"d":"1.1052  "},{"v":1.0857012791,"d":"1.0857  "},{"v":1.0377707873,"d":"1.0378  "},{"v":1.06215513,"d":"1.0622  "},{"v":1.0265803347,"d":"1.0266  "},{"v":0.7628946809,"d":"0.7629  "},{"v":0.897991231,"d":"0.8980  "},{"v":1,"d":"1.0000  "},"Mo",{"v":1.1052461689,"d":"1.1052  "},"Gewerbe","Hauptprofil"]
[8,"GBH","Beherbergung",{"v":0.9766940095,"d":"0.9767  "},{"v":1.0389446761,"d":"1.0389  "},{"v":1.0028244082,"d":"1.0028  "},{"v":1.0161945715,"d":"1.0162  "},{"v":1.0023537775,"d":"1.0024  "},{"v":1.0043297858,"d":"1.0043  "},{"v":0.9583670626,"d":"0.9584  "},{"v":1,"d":"1.0000  "},"Di",{"v":1.0389446761,"d":"1.0389  "},"Gewerbe","Hauptprofil"]
{"$rows_left_out":7}